Reaction Details
TargetDopamine beta-hydroxylase
LigandBDBM50548688
Substrate/Competitorn/a
Meas. Tech.ChEMBL_2022933 (CHEMBL4676746)
IC50 39±n/a nM
Citation Lin, SXCurtis, MASperry, J Pyridine alkaloids with activity in the central nervous system. Bioorg Med Chem28:0 (2020) 
 
Dopamine beta-hydroxylase
Name:Dopamine beta-hydroxylase
Type:PROTEIN
Mol. Mass.:68136.39
Organism:Bos taurus
Description:ChEMBL_50738
Residue:610
BDBM50548688
NameBDBM50548688
Synonyms:CHEMBL4764135
TypeSmall organic molecule
Emp. Form.C13H11NO3
Mol. Mass.229.2313
SMILESOC(=O)c1ccc(Cc2ccc(O)cc2)cn1