Reaction Details
TargetIntegrin alpha-4/beta-1
LigandBDBM50108213
Substrate/Competitorn/a
Meas. Tech.ChEMBL_217306 (CHEMBL823927)
IC50 0.200000±n/a nM
Citation Lin, LSLanza, TMcCauley, EVan Riper, GKidambi, UCao, JEgger, LAMumford, RASchmidt, JAMacCoss, MHagmann, WK Specific and dual antagonists of alpha(4)beta(1) and alpha(4)beta(7) integrins. Bioorg Med Chem Lett12:133-6 (2001) Integrin alpha-4/beta-1
Name:Integrin alpha-4/beta-1
Type:n/a
Mol. Mass.:n/a
Description:ASSAY_ID of EBI is 88912
Components:This complex has 2 components.
Component 1
Name:Integrin beta-1
Synonyms:CD_antigen=CD29 Fibronectin receptor beta GPIIA ITGB1 MDF2 | MSK12
Type:Enzyme
Mol. Mass.:88400.38
Organism:Homo sapiens (Human)
Description:P05556
Residue:798
Component 2
Name:Integrin alpha-4
Synonyms:CD49 antigen-like family member D CD49d antigen ITA4_HUMAN Integrin alpha-4 Integrin alpha-IV VLA-4 integrin alpha 4 precursor | integrin alpha-4 precursor
Type:Membrane Protein
Mol. Mass.:114897.35
Organism:Homo sapiens (Human)
Description:P13612
Residue:1032
BDBM50108213
NameBDBM50108213
Synonyms:(S)-2-[((S)-3-Acetyl-thiazolidine-4-carbonyl)-amino]-3-(2'-methoxy-biphenyl-4-yl)-propionic acid | CHEMBL282637
TypeSmall organic molecule
Emp. Form.C22H24N2O5S
Mol. Mass.428.501
SMILESCOc1ccccc1-c1ccc(C[C@H](NC(=O)[C@H]2CSCN2C(C)=O)C(O)=O)cc1