Reaction Details
TargetIntegrin alpha-4/beta-7
LigandBDBM50108343
Substrate/Competitorn/a
Meas. Tech.ChEMBL_217475 (CHEMBL823551)
IC50 4.4±n/a nM
Citation Chang, LLTruong, QMumford, RAEgger, LAKidambi, ULyons, KMcCauley, EVan Riper, GVincent, SSchmidt, JAMacCoss, MHagmann, WK The discovery of small molecule carbamates as potent dual alpha(4)beta(1)/alpha(4)beta(7) integrin antagonists. Bioorg Med Chem Lett12:159-63 (2001) Integrin alpha-4/beta-7
Name:Integrin alpha-4/beta-7
Type:Protein Complex
Mol. Mass.:n/a
Description:The assay uses stably transfected K562 cells expressing human alpha4beta7 integrin.
Components:This complex has 2 components.
Component 1
Name:Integrin alpha-4
Synonyms:CD49 antigen-like family member D CD49d antigen ITA4_HUMAN Integrin alpha-4 Integrin alpha-IV VLA-4 integrin alpha 4 precursor | integrin alpha-4 precursor
Type:Membrane Protein
Mol. Mass.:114897.35
Organism:Homo sapiens (Human)
Description:P13612
Residue:1032
Component 2
Name:Integrin beta-7
Synonyms:ITB7_HUMAN Integrin alpha-4/beta-7 Integrin beta7
Type:Membrane Protein
Mol. Mass.:86893.88
Organism:Homo sapiens (Human)
Description:P26010
Residue:798
BDBM50108343
NameBDBM50108343
Synonyms:CHEMBL43858 | Pyrrolidine-1-carboxylic acid 4-{(S)-2-carboxy-2-[((S)-1-methanesulfonyl-pyrrolidine-2-carbonyl)-amino]-ethyl}-phenyl ester
TypeSmall organic molecule
Emp. Form.C20H27N3O7S
Mol. Mass.453.509
SMILESCS(=O)(=O)N1CCC[C@H]1C(=O)N[C@@H](Cc1ccc(OC(=O)N2CCCC2)cc1)C(O)=O