Reaction Details
TargetIntegrin alpha-4/beta-7
LigandBDBM50108332
Substrate/Competitorn/a
Meas. Tech.ChEMBL_217475 (CHEMBL823551)
IC50 13±n/a nM
Citation Chang, LLTruong, QMumford, RAEgger, LAKidambi, ULyons, KMcCauley, EVan Riper, GVincent, SSchmidt, JAMacCoss, MHagmann, WK The discovery of small molecule carbamates as potent dual alpha(4)beta(1)/alpha(4)beta(7) integrin antagonists. Bioorg Med Chem Lett12:159-63 (2001) Integrin alpha-4/beta-7
Name:Integrin alpha-4/beta-7
Type:Protein Complex
Mol. Mass.:n/a
Description:The assay uses stably transfected K562 cells expressing human alpha4beta7 integrin.
Components:This complex has 2 components.
Component 1
Name:Integrin alpha-4
Synonyms:CD49 antigen-like family member D CD49d antigen ITA4_HUMAN Integrin alpha-4 Integrin alpha-IV VLA-4 integrin alpha 4 precursor | integrin alpha-4 precursor
Type:Membrane Protein
Mol. Mass.:114897.35
Organism:Homo sapiens (Human)
Description:P13612
Residue:1032
Component 2
Name:Integrin beta-7
Synonyms:ITB7_HUMAN Integrin alpha-4/beta-7 Integrin beta7
Type:Membrane Protein
Mol. Mass.:86893.88
Organism:Homo sapiens (Human)
Description:P26010
Residue:798
BDBM50108332
NameBDBM50108332
Synonyms:1H-Pyrrole-2-carboxylic acid 4-((S)-2-carboxy-2-{[(S)-1-(3,5-dichloro-benzenesulfonyl)-pyrrolidine-2-carbonyl]-amino}-ethyl)-phenyl ester | CHEMBL41129
TypeSmall organic molecule
Emp. Form.C25H23Cl2N3O7S
Mol. Mass.580.437
SMILESOC(=O)[C@H](Cc1ccc(OC(=O)c2ccc[nH]2)cc1)NC(=O)[C@@H]1CCCN1S(=O)(=O)c1cc(Cl)cc(Cl)c1