Reaction Details
TargetProteasome subunit beta type-8
LigandBDBM50234984
Substrate/Competitorn/a
Meas. Tech.ChEMBL_2024063 (CHEMBL4677876)
IC50 1.1±n/a nM
Citation Zhao, YXu, LZhang, JZhang, MLu, JHe, RXi, JZhuang, RLi, JZhou, Y Optimization of piperidine constructed peptidyl derivatives as proteasome inhibitors. Bioorg Med Chem29:0 (2021) 
 
Proteasome subunit beta type-8
Name:Proteasome subunit beta type-8
Type:PROTEIN
Mol. Mass.:30357.49
Organism:Homo sapiens (Human)
Description:ChEMBL_1446797
Residue:276
BDBM50234984
NameBDBM50234984
Synonyms:CHEMBL3218837
TypeSmall organic molecule
Emp. Form.C34H37ClN6O5
Mol. Mass.645.148
SMILESCC(C)(C)CNC(=O)C[C@H](NC(=O)C(=O)c1c[nH]c2ccccc12)C(=O)N[C@@H](Cc1ccncc1)C(=O)NCc1ccccc1Cl