Reaction Details
TargetPepsin A-5
LigandBDBM50108798
Substrate/Competitorn/a
Meas. Tech.ChEMBL_154150 (CHEMBL759820)
Ki 1.5±n/a nM
Citation Bursavich, MGRich, DH Designing non-peptide peptidomimetics in the 21st century: inhibitors targeting conformational ensembles. J Med Chem45:541-58 (2002) Pepsin A-5
Name:Pepsin A-5
Type:PROTEIN
Mol. Mass.:41971.56
Organism:Homo sapiens (Human)
Description:ChEMBL_1452206
Residue:388
BDBM50108798
NameBDBM50108798
Synonyms:CHEMBL3143437 | {1-[1-(1-{1-Hydroxy-2-[1-(3-methyl-butylcarbamoyl)-ethylcarbamoyl]-ethyl}-3-methyl-butylcarbamoyl)-2-methyl-propylcarbamoyl]-2-methyl-propyl}-carbamic acid 3-methyl-butyl ester
TypeSmall organic molecule
Emp. Form.C33H63N5O7
Mol. Mass.641.8826
SMILESCC(C)CCNC(=O)[C@H](C)NC(=O)C[C@@](C)(O)[C@H](CC(C)C)NC(=O)[C@@H](NC(=O)[C@@H](NC(=O)OCCC(C)C)C(C)C)C(C)C