Reaction Details
TargetCruzipain
LigandBDBM50108873
Substrate/Competitorn/a
Meas. Tech.ChEMBL_51847 (CHEMBL664070)
Ki 5.8±n/a nM
Citation Huang, LLee, AEllman, JA Identification of potent and selective mechanism-based inhibitors of the cysteine protease cruzain using solid-phase parallel synthesis. J Med Chem45:676-84 (2002) Cruzipain
Name:Cruzipain
Type:Protein
Mol. Mass.:49831.41
Organism:Trypanosoma cruzi
Description:P25779
Residue:467
BDBM50108873
NameBDBM50108873
Synonyms:CHEMBL161424 benzyl (S)-1-((S)-4-(sec-butylthio)-3-oxo-1-phenylbutan-2-ylamino)-1-oxo-3-phenylpropan-2-ylcarbamate
TypeSmall organic molecule
Emp. Form.C31H36N2O4S
Mol. Mass.532.694
SMILESCCC(C)SCC(=O)[C@H](Cc1ccccc1)NC(=O)[C@H](Cc1ccccc1)NC(=O)OCc1ccccc1