Reaction Details
TargetProcathepsin L
LigandBDBM50108862
Substrate/Competitorn/a
Meas. Tech.ChEMBL_48504 (CHEMBL660653)
Ki 1.7±n/a nM
Citation Huang, LLee, AEllman, JA Identification of potent and selective mechanism-based inhibitors of the cysteine protease cruzain using solid-phase parallel synthesis. J Med Chem45:676-84 (2002) Procathepsin L
Name:Procathepsin L
Type:Enzyme
Mol. Mass.:37557.19
Organism:Homo sapiens (Human)
Description:Purchased from Calbiochem (San Diego, CA).
Residue:333
BDBM50108862
NameBDBM50108862
Synonyms:CHEMBL161651 benzyl (S)-1-((S)-4-(tert-butylthio)-3-oxo-1-phenylbutan-2-ylamino)-1-oxo-3-phenylpropan-2-ylcarbamate
TypeSmall organic molecule
Emp. Form.C31H36N2O4S
Mol. Mass.532.694
SMILESCC(C)(C)SCC(=O)[C@H](Cc1ccccc1)NC(=O)[C@H](Cc1ccccc1)NC(=O)OCc1ccccc1