Reaction Details
TargetSodium-dependent serotonin transporter
LigandBDBM50109054
Substrate/Competitorn/a
Meas. Tech.ChEBML_201366
Ki 47±n/a nM
Citation Mewshaw, REMeagher, KLZhou, PZhou, DShi, XScerni, RSmith, DSchechter, LEAndree, TH Studies toward the discovery of the next generation of antidepressants. Part 2: incorporating a 5-HT(1A) antagonist component into a class of serotonin reuptake inhibitors. Bioorg Med Chem Lett12:307-10 (2002) Sodium-dependent serotonin transporter
Name:Sodium-dependent serotonin transporter
Type:Multi-pass membrane protein
Mol. Mass.:70322.51
Organism:Homo sapiens (Human)
Description:P31645
Residue:630
BDBM50109054
NameBDBM50109054
Synonyms:3-{1-[2-(2,3-Dihydro-benzo[1,4]dioxin-5-yloxy)-ethyl]-1,2,3,6-tetrahydro-pyridin-4-yl}-5-fluoro-1H-indole | CHEMBL105390
TypeSmall organic molecule
Emp. Form.C23H23FN2O3
Mol. Mass.394.4387
SMILESFc1ccc2[nH]cc(C3=CCN(CCOc4cccc5OCCOc45)CC3)c2c1