Reaction Details
TargetSodium-dependent serotonin transporter
LigandBDBM50109058
Substrate/Competitorn/a
Meas. Tech.ChEBML_201809
Ki 0.030000±n/a nM
Citation Mewshaw, REMeagher, KLZhou, PZhou, DShi, XScerni, RSmith, DSchechter, LEAndree, TH Studies toward the discovery of the next generation of antidepressants. Part 2: incorporating a 5-HT(1A) antagonist component into a class of serotonin reuptake inhibitors. Bioorg Med Chem Lett12:307-10 (2002) Sodium-dependent serotonin transporter
Name:Sodium-dependent serotonin transporter
Type:Multi-pass membrane protein
Mol. Mass.:70168.43
Organism:Rattus norvegicus (rat)
Description:P31652
Residue:630
BDBM50109058
NameBDBM50109058
Synonyms:1H-4-indolyl 2-[4-(1H-3-indolyl)-1,2,3,6-tetrahydro-1-pyridinyl]ethyl ether | CHEMBL421027
TypeSmall organic molecule
Emp. Form.C23H23N3O
Mol. Mass.357.4482
SMILESC(CN1CCC(=CC1)c1c[nH]c2ccccc12)Oc1cccc2[nH]ccc12