Reaction Details
TargetSodium-dependent serotonin transporter
LigandBDBM50109059
Substrate/Competitorn/a
Meas. Tech.ChEBML_201366
Ki 128±n/a nM
Citation Mewshaw, REMeagher, KLZhou, PZhou, DShi, XScerni, RSmith, DSchechter, LEAndree, TH Studies toward the discovery of the next generation of antidepressants. Part 2: incorporating a 5-HT(1A) antagonist component into a class of serotonin reuptake inhibitors. Bioorg Med Chem Lett12:307-10 (2002) Sodium-dependent serotonin transporter
Name:Sodium-dependent serotonin transporter
Type:Multi-pass membrane protein
Mol. Mass.:70322.51
Organism:Homo sapiens (Human)
Description:P31645
Residue:630
BDBM50109059
NameBDBM50109059
Synonyms:3-{1-[2-(2,3-Dihydro-benzo[1,4]dioxin-5-yloxy)-ethyl]-piperidin-4-yl}-6-fluoro-1H-indole | CHEMBL322915
TypeSmall organic molecule
Emp. Form.C23H25FN2O3
Mol. Mass.396.4546
SMILESFc1ccc2c(c[nH]c2c1)C1CCN(CCOc2cccc3OCCOc23)CC1