Reaction Details
TargetSodium-dependent serotonin transporter
LigandBDBM50109057
Substrate/Competitorn/a
Meas. Tech.ChEBML_201809
Ki 0.150000±n/a nM
Citation Mewshaw, REMeagher, KLZhou, PZhou, DShi, XScerni, RSmith, DSchechter, LEAndree, TH Studies toward the discovery of the next generation of antidepressants. Part 2: incorporating a 5-HT(1A) antagonist component into a class of serotonin reuptake inhibitors. Bioorg Med Chem Lett12:307-10 (2002) Sodium-dependent serotonin transporter
Name:Sodium-dependent serotonin transporter
Type:Multi-pass membrane protein
Mol. Mass.:70168.43
Organism:Rattus norvegicus (rat)
Description:P31652
Residue:630
BDBM50109057
NameBDBM50109057
Synonyms:3-{1-[2-(2,3-Dihydro-benzo[1,4]dioxin-5-yloxy)-ethyl]-1,2,3,6-tetrahydro-pyridin-4-yl}-6-fluoro-1H-indole | CHEMBL105204
TypeSmall organic molecule
Emp. Form.C23H23FN2O3
Mol. Mass.394.4387
SMILESFc1ccc2c(c[nH]c2c1)C1=CCN(CCOc2cccc3OCCOc23)CC1