Reaction Details
Target5-hydroxytryptamine receptor 1A
LigandBDBM50109056
Substrate/Competitorn/a
Meas. Tech.ChEBML_681
IC50 90.0±n/a nM
Citation Mewshaw, REMeagher, KLZhou, PZhou, DShi, XScerni, RSmith, DSchechter, LEAndree, TH Studies toward the discovery of the next generation of antidepressants. Part 2: incorporating a 5-HT(1A) antagonist component into a class of serotonin reuptake inhibitors. Bioorg Med Chem Lett12:307-10 (2002) 5-hydroxytryptamine receptor 1A
Name:5-hydroxytryptamine receptor 1A
Type:n/a
Mol. Mass.:46122.49
Organism:Homo sapiens (Human)
Description:n/a
Residue:422
BDBM50109056
NameBDBM50109056
Synonyms:5-{2-[4-(1H-Pyrrolo[2,3-b]pyridin-3-yl)-3,6-dihydro-2H-pyridin-1-yl]-ethoxy}-quinoline | CHEMBL442391
TypeSmall organic molecule
Emp. Form.C23H22N4O
Mol. Mass.370.447
SMILESC(CN1CCC(=CC1)c1c[nH]c2ncccc12)Oc1cccc2ncccc12