Reaction Details
TargetPhosphatidylinositol 4,5-bisphosphate 3-kinase catalytic subunit gamma isoform
LigandBDBM50549840
Substrate/Competitorn/a
Meas. Tech.ChEMBL_2025880 (CHEMBL4679693)
Ki 6.0±n/a nM
Citation Bandarage, UKAronov, AMCao, JCome, JHCottrell, KMDavies, RJGiroux, SJacobs, MMahajan, SMessersmith, DMoody, CSSwett, RXu, J Discovery of a Novel Series of Potent and Selective Alkynylthiazole-Derived PI3K? Inhibitors. ACS Med Chem Lett12:129-135 (2021) 
 
Phosphatidylinositol 4,5-bisphosphate 3-kinase catalytic subunit gamma isoform
Name:Phosphatidylinositol 4,5-bisphosphate 3-kinase catalytic subunit gamma isoform
Type:Enzyme Subunit
Mol. Mass.:126470.30
Organism:Homo sapiens (Human)
Description:P48736
Residue:1102
BDBM50549840
NameBDBM50549840
Synonyms:CHEMBL4800674
TypeSmall organic molecule
Emp. Form.C18H19FN4O2S
Mol. Mass.374.432
SMILESCc1nc(NC(=O)NCCOCC2CC2)sc1C#Cc1ccnc(F)c1