Reaction Details
TargetPhosphatidylinositol 4,5-bisphosphate 3-kinase catalytic subunit gamma isoform
LigandBDBM50549855
Substrate/Competitorn/a
Meas. Tech.ChEMBL_2025880 (CHEMBL4679693)
Ki 3.0±n/a nM
Citation Bandarage, UKAronov, AMCao, JCome, JHCottrell, KMDavies, RJGiroux, SJacobs, MMahajan, SMessersmith, DMoody, CSSwett, RXu, J Discovery of a Novel Series of Potent and Selective Alkynylthiazole-Derived PI3K? Inhibitors. ACS Med Chem Lett12:129-135 (2021) 
 
Phosphatidylinositol 4,5-bisphosphate 3-kinase catalytic subunit gamma isoform
Name:Phosphatidylinositol 4,5-bisphosphate 3-kinase catalytic subunit gamma isoform
Type:Enzyme Subunit
Mol. Mass.:126470.30
Organism:Homo sapiens (Human)
Description:P48736
Residue:1102
BDBM50549855
NameBDBM50549855
Synonyms:CHEMBL4756664
TypeSmall organic molecule
Emp. Form.C21H26N4O2S
Mol. Mass.398.522
SMILESC[C@@H](CNC(=O)Nc1nc(C)c(s1)C#Cc1cnc(C)c(C)c1)OCC1CC1