Reaction Details
TargetKynureninase
LigandBDBM50109155
Substrate/Competitorn/a
Meas. Tech.ChEBML_91728
Ki 130±n/a nM
Citation Walsh, HALeslie, PLO'Shea, KCBotting, NP 2-Amino-4-[3'-hydroxyphenyl]-4-hydroxybutanoic acid; a potent inhibitor of rat and recombinant human kynureninase. Bioorg Med Chem Lett12:361-3 (2002) Kynureninase
Name:Kynureninase
Type:PROTEIN
Mol. Mass.:52470.50
Organism:Rattus norvegicus
Description:ChEMBL_91725
Residue:464
BDBM50109155
NameBDBM50109155
Synonyms:2-Amino-4-hydroxy-4-(3-hydroxy-phenyl)-butyric acid CHEMBL120534
TypeSmall organic molecule
Emp. Form.C10H13NO4
Mol. Mass.211.2145
SMILESNC(CC(O)c1cccc(O)c1)C(O)=O