Reaction Details
TargetDual specificity mitogen-activated protein kinase kinase 1
LigandBDBM50109282
Substrate/Competitorn/a
Meas. Tech.ChEBML_60852
IC50 10±n/a nM
Citation Zhang, NWu, BWissner, APowell, DWRabindran, SKKohler, CBoschelli, F 4-Anilino-3-cyanobenzo[g]quinolines as kinase inhibitors. Bioorg Med Chem Lett12:423-5 (2002) Dual specificity mitogen-activated protein kinase kinase 1
Name:Dual specificity mitogen-activated protein kinase kinase 1
Type:Other Protein Type
Mol. Mass.:43439.03
Organism:Homo sapiens (Human)
Description:Full-length human MEK-1 was generated by PCR and purified as a fusion protein from Escherichia coli lysates.
Residue:393
BDBM50109282
NameBDBM50109282
Synonyms:7,8-Dimethoxy-4-(4-phenoxy-phenylamino)-benzo[g]quinoline-3-carbonitrile | CHEMBL337728
TypeSmall organic molecule
Emp. Form.C28H21N3O3
Mol. Mass.447.4846
SMILESCOc1cc2cc3ncc(C#N)c(Nc4ccc(Oc5ccccc5)cc4)c3cc2cc1OC