Reaction Details
TargetMu-type opioid receptor
LigandBDBM50550066
Substrate/Competitorn/a
Meas. Tech.ChEMBL_2026352 (CHEMBL4680510)
EC50 0.017000±n/a nM
Citation Gutman, ESBow, ELi, FSulima, AKaska, SCrowley, RPrisinzano, TELee, YSHassan, SAImler, GHDeschamps, JRJacobson, AERice, KC G-Protein biased opioid agonists: 3-hydroxy- RSC Med Chem11:896-904 (2020) 
 
Mu-type opioid receptor
Name:Mu-type opioid receptor
Type:G Protein-Coupled Receptor (GPCR)
Mol. Mass.:44789.51
Organism:Homo sapiens (Human)
Description:P35372
Residue:400
BDBM50550066
NameBDBM50550066
Synonyms:CHEMBL4798954
TypeSmall organic molecule
Emp. Form.C22H27NO2
Mol. Mass.337.4553
SMILES[H][C@]12CCC[C@@](CCN1CCc1ccccc1)([C@@H]2O)c1cccc(O)c1