Reaction Details
TargetDelta-type opioid receptor
LigandBDBM21025
Substrate/Competitorn/a
Meas. Tech.ChEMBL_2026356 (CHEMBL4680514)
EC50 0.020000±n/a nM
Citation Gutman, ESBow, ELi, FSulima, AKaska, SCrowley, RPrisinzano, TELee, YSHassan, SAImler, GHDeschamps, JRJacobson, AERice, KC G-Protein biased opioid agonists: 3-hydroxy- RSC Med Chem11:896-904 (2020) 
 
Delta-type opioid receptor
Name:Delta-type opioid receptor
Type:G Protein-Coupled Receptor (GPCR)
Mol. Mass.:40382.98
Organism:Homo sapiens (Human)
Description:Competition binding assays were carried out using membrane preparations from transfected HN9.10 cells that constitutively expressed the delta opioid receptor.
Residue:372
BDBM21025
NameBDBM21025
Synonyms:(2R)-2-[(2S)-2-{2-[(2R)-2-[(2S)-2-amino-3-(4-hydroxyphenyl)propanamido]propanamido]acetamido}-3-phenylpropanamido]-4-methylpentanoic acid BW-180C DADLE H-Tyr-D-Ala-Gly-Phe-D-Leu-OH | [D-Ala2-D-Leu5]enkephalin
TypeANALGESIC
Emp. Form.C29H39N5O7
Mol. Mass.569.6493
SMILESCC(C)C[C@@H](NC(=O)[C@H](Cc1ccccc1)NC(=O)CNC(=O)[C@@H](C)NC(=O)[C@@H](N)Cc1ccc(O)cc1)C(O)=O