Reaction Details
TargetMitogen-activated protein kinase 8
LigandBDBM50550127
Substrate/Competitorn/a
Meas. Tech.ChEMBL_2026446 (CHEMBL4680604)
Kd 220±n/a nM
Citation Wang, CBLorente-Macías, ÁWells, CPickett, JEPicado, AZuercher, WJAxtman, AD Towards a RIOK2 chemical probe: cellular potency improvement of a selective 2-(acylamino)pyridine series. RSC Med Chem12:129-136 (2021) 
 
Mitogen-activated protein kinase 8
Name:Mitogen-activated protein kinase 8
Type:Enzyme
Mol. Mass.:48297.57
Organism:Homo sapiens (Human)
Description:JNK-1 was purchased from Upstate Cell Signaling Solutions (formerly Upstate Biotechnology).
Residue:427
BDBM50550127
NameBDBM50550127
Synonyms:CHEMBL4781866
TypeSmall organic molecule
Emp. Form.C18H16N2O
Mol. Mass.276.3324
SMILESCc1ccnc(NC(=O)Cc2ccc3ccccc3c2)c1