Reaction Details
TargetMitogen-activated protein kinase 10
LigandBDBM50550127
Substrate/Competitorn/a
Meas. Tech.ChEMBL_2026447 (CHEMBL4680605)
Kd 340±n/a nM
Citation Wang, CBLorente-Macías, ÁWells, CPickett, JEPicado, AZuercher, WJAxtman, AD Towards a RIOK2 chemical probe: cellular potency improvement of a selective 2-(acylamino)pyridine series. RSC Med Chem12:129-136 (2021) 
 
Mitogen-activated protein kinase 10
Name:Mitogen-activated protein kinase 10
Type:Enzyme
Mol. Mass.:52586.89
Organism:Homo sapiens (Human)
Description:n/a
Residue:464
BDBM50550127
NameBDBM50550127
Synonyms:CHEMBL4781866
TypeSmall organic molecule
Emp. Form.C18H16N2O
Mol. Mass.276.3324
SMILESCc1ccnc(NC(=O)Cc2ccc3ccccc3c2)c1