Reaction Details
TargetAdenosine receptor A3
LigandBDBM50109481
Substrate/Competitorn/a
Meas. Tech.ChEMBL_32022 (CHEMBL649058)
Ki 0.15±n/a nM
Citation Baraldi, PGCacciari, BMoro, SSpalluto, GPastorin, GDa Ros, TKlotz, KNVarani, KGessi, SBorea, PA Synthesis, biological activity, and molecular modeling investigation of new pyrazolo[4,3-e]-1,2,4-triazolo[1,5-c]pyrimidine derivatives as human A(3) adenosine receptor antagonists. J Med Chem45:770-80 (2002) Adenosine receptor A3
Name:Adenosine receptor A3
Type:G Protein-Coupled Receptor (GPCR)
Mol. Mass.:36197.32
Organism:Homo sapiens (Human)
Description:P0DMS8
Residue:318
BDBM50109481
NameBDBM50109481
Synonyms:1-(2-(furan-2-yl)-8-propyl-8H-pyrazolo[4,3-e][1,2,4]triazolo[1,5-c]pyrimidin-5-yl)-3-phenylurea CHEMBL168018 | MRE 3055F20
TypeSmall organic molecule
Emp. Form.C20H18N8O2
Mol. Mass.402.4093
SMILESCCCn1cc2c(n1)nc(NC(=O)Nc1ccccc1)n1nc(nc21)-c1ccco1