Reaction Details
TargetAdenosine receptor A3
LigandBDBM50094694
Substrate/Competitorn/a
Meas. Tech.ChEMBL_32021 (CHEMBL649057)
Ki 0.14±n/a nM
Citation Baraldi, PGCacciari, BMoro, SSpalluto, GPastorin, GDa Ros, TKlotz, KNVarani, KGessi, SBorea, PA Synthesis, biological activity, and molecular modeling investigation of new pyrazolo[4,3-e]-1,2,4-triazolo[1,5-c]pyrimidine derivatives as human A(3) adenosine receptor antagonists. J Med Chem45:770-80 (2002) Adenosine receptor A3
Name:Adenosine receptor A3
Type:G Protein-Coupled Receptor (GPCR)
Mol. Mass.:36197.32
Organism:Homo sapiens (Human)
Description:P0DMS8
Residue:318
BDBM50094694
NameBDBM50094694
Synonyms:1-(9-Chloro-2-furan-2-yl-[1,2,4]triazolo[1,5-c]quinazolin-5-yl)-3-(4-methoxy-phenyl)-urea | CHEMBL144979
TypeSmall organic molecule
Emp. Form.C21H15ClN6O3
Mol. Mass.434.835
SMILESCOc1ccc(NC(=O)Nc2nc3ccc(Cl)cc3c3nc(nn23)-c2ccco2)cc1