Reaction Details
TargetAdenosine receptor A1
LigandBDBM50094691
Substrate/Competitorn/a
Meas. Tech.ChEMBL_27898 (CHEMBL640558)
Ki 1097±n/a nM
Citation Baraldi, PGCacciari, BMoro, SSpalluto, GPastorin, GDa Ros, TKlotz, KNVarani, KGessi, SBorea, PA Synthesis, biological activity, and molecular modeling investigation of new pyrazolo[4,3-e]-1,2,4-triazolo[1,5-c]pyrimidine derivatives as human A(3) adenosine receptor antagonists. J Med Chem45:770-80 (2002) Adenosine receptor A1
Name:Adenosine receptor A1
Type:G Protein-Coupled Receptor (GPCR)
Mol. Mass.:36520.92
Organism:Homo sapiens (Human)
Description:P30542
Residue:326
BDBM50094691
NameBDBM50094691
Synonyms:1-(2-(furan-2-yl)-8-methyl-8H-pyrazolo[4,3-e][1,2,4]triazolo[1,5-c]pyrimidin-5-yl)-3-(4-methoxyphenyl)urea CHEMBL329791
TypeSmall organic molecule
Emp. Form.C19H16N8O3
Mol. Mass.404.3821
SMILESCOc1ccc(NC(=O)Nc2nc3nn(C)cc3c3nc(nn23)-c2ccco2)cc1