Reaction Details
TargetProtein kinase C delta type
LigandBDBM50057514
Substrate/Competitorn/a
Meas. Tech.ChEMBL_161472 (CHEMBL770275)
Ki 0.1±n/a nM
Citation Rong, SBEnyedy, IJQiao, LZhao, LMa, DPearce, LLLorenzo, PSStone, JCBlumberg, PMWang, SKozikowski, AP Structural basis of RasGRP binding to high-affinity PKC ligands. J Med Chem45:853-60 (2002) Protein kinase C delta type
Name:Protein kinase C delta type
Type:PROTEIN
Mol. Mass.:77554.99
Organism:Mus musculus
Description:ChEMBL_1351519
Residue:674
BDBM50057514
NameBDBM50057514
Synonyms:(10S,13S)-13-Hydroxymethyl-10-isopropyl-9-methyl-5-octyl-3,9,12-triaza-tricyclo[6.6.1.0*4,15*]pentadeca-1,4,6,8(15)-tetraen-11-one CHEMBL285801
TypeSmall organic molecule
Emp. Form.C25H39N3O2
Mol. Mass.413.5961
SMILESCCCCCCCCc1ccc2N(C)[C@@H](C(C)C)C(=O)N[C@H](CO)Cc3c[nH]c1c23