Reaction Details
TargetRAS guanyl-releasing protein 1
LigandBDBM50057509
Substrate/Competitorn/a
Meas. Tech.ChEMBL_163499 (CHEMBL772411)
Ki 6.15±n/a nM
Citation Rong, SBEnyedy, IJQiao, LZhao, LMa, DPearce, LLLorenzo, PSStone, JCBlumberg, PMWang, SKozikowski, AP Structural basis of RasGRP binding to high-affinity PKC ligands. J Med Chem45:853-60 (2002) RAS guanyl-releasing protein 1
Name:RAS guanyl-releasing protein 1
Type:PROTEIN
Mol. Mass.:90263.87
Organism:Rattus norvegicus
Description:ChEMBL_163499
Residue:795
BDBM50057509
NameBDBM50057509
Synonyms:(2S,5S)-8-Dec-1-ynyl-5-hydroxymethyl-2-isopropyl-1-methyl-1,4,5,6-tetrahydro-2H-benzo[e][1,4]diazocin-3-one CHEMBL6453
TypeSmall organic molecule
Emp. Form.C25H38N2O2
Mol. Mass.398.5814
SMILESCCCCCCCCC#Cc1ccc2N(C)[C@@H](C(C)C)C(=O)N[C@H](CO)Cc2c1