Reaction Details
TargetCarboxypeptidase A1
LigandBDBM50109600
Substrate/Competitorn/a
Meas. Tech.ChEMBL_45617 (CHEMBL655428)
Ki 2100±n/a nM
Citation Park, JDKim, DH Cysteine derivatives as inhibitors for carboxypeptidase A: synthesis and structure-activity relationships. J Med Chem45:911-8 (2002) Carboxypeptidase A1
Name:Carboxypeptidase A1
Type:Enzyme
Mol. Mass.:47073.90
Organism:Bos taurus (bovine)
Description:From Sigma-Aldrich Co.
Residue:419
BDBM50109600
NameBDBM50109600
Synonyms:2-Mercaptomethyl-4-phenyl-butyric acid | CHEMBL173587
TypeSmall organic molecule
Emp. Form.C11H14O2S
Mol. Mass.210.293
SMILESOC(=O)C(CS)CCc1ccccc1