Reaction Details
TargetCarboxypeptidase A1
LigandBDBM50109609
Substrate/Competitorn/a
Meas. Tech.ChEMBL_45617 (CHEMBL655428)
Ki 350000±n/a nM
Citation Park, JDKim, DH Cysteine derivatives as inhibitors for carboxypeptidase A: synthesis and structure-activity relationships. J Med Chem45:911-8 (2002) Carboxypeptidase A1
Name:Carboxypeptidase A1
Type:Enzyme
Mol. Mass.:47073.90
Organism:Bos taurus (bovine)
Description:From Sigma-Aldrich Co.
Residue:419
BDBM50109609
NameBDBM50109609
Synonyms:(2R)-2-amino-3-mercaptopropanoic acid (R)-2-amino-3-mercaptopropanoic acid CYSTEINE L-Cystein L-cysteine | US11021454, Compound L-cys
TypeSmall organic molecule
Emp. Form.C3H7NO2S
Mol. Mass.121.158
SMILESN[C@@H](CS)C(O)=O