Reaction Details
TargetSigma non-opioid intracellular receptor 1
LigandBDBM50064946
Substrate/Competitorn/a
Meas. Tech.ChEMBL_2027128 (CHEMBL4681286)
Ki 2.9±n/a nM
Citation Olivieri, MAmata, EVinciguerra, SFiorito, JGiurdanella, GDrago, FCaporarello, NPrezzavento, OArena, ESalerno, LRescifina, ALupo, GAnfuso, CDMarrazzo, A Antiangiogenic Effect of (±)-Haloperidol Metabolite II Valproate Ester [(±)-MRJF22] in Human Microvascular Retinal Endothelial Cells. J Med Chem59:9960-9966 (2016) Sigma non-opioid intracellular receptor 1
Name:Sigma non-opioid intracellular receptor 1
Type:Protein
Mol. Mass.:25307.17
Organism:Cavia porcellus (Guinea pig)
Description:Q60492
Residue:223
BDBM50064946
NameBDBM50064946
Synonyms:4-(4-Chloro-phenyl)-1-[4-(4-fluoro-phenyl)-4-hydroxy-butyl]-piperidin-4-ol Hydroxyhaloperidol
TypeSmall organic molecule
Emp. Form.C21H25ClFNO2
Mol. Mass.377.88
SMILESOC(CCCN1CCC(O)(CC1)c1ccc(Cl)cc1)c1ccc(F)cc1