Reaction Details
TargetSigma non-opioid intracellular receptor 1
LigandBDBM21398
Substrate/Competitorn/a
Meas. Tech.ChEMBL_2027128 (CHEMBL4681286)
Ki 2.7±n/a nM
Citation Olivieri, MAmata, EVinciguerra, SFiorito, JGiurdanella, GDrago, FCaporarello, NPrezzavento, OArena, ESalerno, LRescifina, ALupo, GAnfuso, CDMarrazzo, A Antiangiogenic Effect of (±)-Haloperidol Metabolite II Valproate Ester [(±)-MRJF22] in Human Microvascular Retinal Endothelial Cells. J Med Chem59:9960-9966 (2016) Sigma non-opioid intracellular receptor 1
Name:Sigma non-opioid intracellular receptor 1
Type:Protein
Mol. Mass.:25307.17
Organism:Cavia porcellus (Guinea pig)
Description:Q60492
Residue:223
BDBM21398
NameBDBM21398
Synonyms:4-[4-(4-Chloro-phenyl)-4-hydroxy-piperidin-1-yl]-1-(4-fluoro-phenyl)-butan-1-one;propionate(HCl) CHEMBL54 Haloperidol | Haloperidol, 1
TypeSmall organic molecule
Emp. Form.C21H23ClFNO2
Mol. Mass.375.864
SMILESOC1(CCN(CCCC(=O)c2ccc(F)cc2)CC1)c1ccc(Cl)cc1