Reaction Details
TargetATP-dependent translocase ABCB1
LigandBDBM50109786
Substrate/Competitorn/a
Meas. Tech.ChEBML_64945
IC50 800±n/a nM
Citation Wang, SRyder, HPretswell, IDepledge, PMilton, JHancox, TCDale, IDangerfield, WCharlton, PFaint, RDodd, RHassan, S Studies on quinazolinones as dual inhibitors of Pgp and MRP1 in multidrug resistance. Bioorg Med Chem Lett12:571-4 (2002) ATP-dependent translocase ABCB1
Name:ATP-dependent translocase ABCB1
Type:PROTEIN
Mol. Mass.:141009.67
Organism:Mus musculus
Description:ChEMBL_474396
Residue:1276
BDBM50109786
NameBDBM50109786
Synonyms:3-[2-(6,7-Dimethoxy-3,4-dihydro-1H-isoquinolin-2-yl)-ethyl]-2-(3-propyl-phenyl)-3H-quinazolin-4-one | CHEMBL152590
TypeSmall organic molecule
Emp. Form.C30H33N3O3
Mol. Mass.483.6013
SMILESCCCc1cccc(c1)-c1nc2ccccc2c(=O)n1CCN1CCc2cc(OC)c(OC)cc2C1