Reaction Details
TargetThromboxane-A synthase
LigandBDBM50026486
Substrate/Competitorn/a
Meas. Tech.ChEBML_210290
IC50 0.900000±n/a nM
Citation Fujita, MSeki, TInada, HShimizu, KTakahama, ASano, T Novel agents combining platelet activating factor (PAF) receptor antagonist with thromboxane synthase inhibitor (TxSI). Bioorg Med Chem Lett12:771-4 (2002) Thromboxane-A synthase
Name:Thromboxane-A synthase
Type:Enzyme
Mol. Mass.:60524.67
Organism:Homo sapiens (Human)
Description:P24557
Residue:533
BDBM50026486
NameBDBM50026486
Synonyms:(Z)-7-Phenyl-7-pyridin-3-yl-hept-6-enoic acid CHEMBL28196 | Isbogrel
TypeSmall organic molecule
Emp. Form.C18H19NO2
Mol. Mass.281.349
SMILESOC(=O)CCCC\C=C(\c1ccccc1)c1cccnc1