Reaction Details
TargetMuscarinic acetylcholine receptor M2
LigandBDBM50110532
Substrate/Competitorn/a
Meas. Tech.ChEBML_139772
Ki 0.300000±n/a nM
Citation Kozlowski, JAZhou, GTagat, JRLin, SIMcCombie, SWRuperto, VBDuffy, RAMcQuade, RACrosby, GTaylor, LABillard, WBinch, HLachowicz, JE Substituted 2-(R)-methyl piperazines as muscarinic M(2) selective ligands. Bioorg Med Chem Lett12:791-4 (2002) Muscarinic acetylcholine receptor M2
Name:Muscarinic acetylcholine receptor M2
Type:GPCR
Mol. Mass.:51730.61
Organism:Homo sapiens (Human)
Description:P08172
Residue:466
BDBM50110532
NameBDBM50110532
Synonyms:4-Cyclohexyl-1-{1-[4-(4-methoxy-benzenesulfonyl)-phenyl]-ethyl}-2-methyl-piperazine | CHEMBL163777
TypeSmall organic molecule
Emp. Form.C26H36N2O3S
Mol. Mass.456.641
SMILESCOc1ccc(cc1)S(=O)(=O)c1ccc(cc1)[C@H](C)N1CCN(C[C@H]1C)C1CCCCC1