Reaction Details
TargetSubstance-P receptor
LigandBDBM50110655
Substrate/Competitorn/a
Meas. Tech.ChEBML_205886
Ki 0.600000±n/a nM
Citation Reichard, GASpitler, JAslanian, RMutahi, MShih, NYLin, LTing, PCAnthes, JCPiwinski, JJ Structure-activity relationships of oxime neurokinin antagonists: oxime modifications. Bioorg Med Chem Lett12:833-6 (2002) Substance-P receptor
Name:Substance-P receptor
Type:G Protein-Coupled Receptor (GPCR)
Mol. Mass.:46254.43
Organism:Homo sapiens (Human)
Description:P25103
Residue:407
BDBM50110655
NameBDBM50110655
Synonyms:3,5-Dichloro-N-[3-(3,4-dichloro-phenyl)-2-[(Z)-2-hydroxy-ethoxyimino]-5-(2-oxo-[1,4']bipiperidinyl-1'-yl)-pentyl]-N-methyl-benzamide | CHEMBL352588
TypeSmall organic molecule
Emp. Form.C31H38Cl4N4O4
Mol. Mass.672.47
SMILESCN(C\C(=N/OCCO)C(CCN1CCC(CC1)N1CCCCC1=O)c1ccc(Cl)c(Cl)c1)C(=O)c1cc(Cl)cc(Cl)c1