Reaction Details
TargetGABA-A receptor; alpha-2/beta-3/gamma-2
LigandBDBM50110711
Substrate/Competitorn/a
Meas. Tech.ChEMBL_70389 (CHEMBL683015)
Ki 12±n/a nM
Citation Chambers, MSAtack, JRBromidge, FABroughton, HBCook, SDawson, GRHobbs, SCMaubach, KAReeve, AJSeabrook, GRWafford, KMacLeod, AM 6,7-Dihydro-2-benzothiophen-4(5H)-ones: a novel class of GABA-A alpha5 receptor inverse agonists. J Med Chem45:1176-9 (2002) GABA-A receptor; alpha-2/beta-3/gamma-2
Name:GABA-A receptor; alpha-2/beta-3/gamma-2
Type:n/a
Mol. Mass.:n/a
Description:ASSAY_ID of ChEMBL is 2148174
Components:This complex has 3 components.
Component 1
Name:Gamma-aminobutyric acid receptor subunit gamma-2
Synonyms:GABA(A) receptor subunit gamma-2 GBRG2_HUMAN
Type:PROTEIN
Mol. Mass.:54172.74
Organism:Homo sapiens (Human)
Description:EBI_217
Residue:467
Component 2
Name:Gamma-aminobutyric acid receptor subunit beta-3
Synonyms:GABA A receptor alpha-4/beta-3/gamma-2 GABA-A receptor GBRB3_HUMAN | agonist GABA site
Type:PROTEIN
Mol. Mass.:54130.51
Organism:Homo sapiens (Human)
Description:ChEMBL_448071
Residue:473
Component 3
Name:Gamma-aminobutyric acid receptor subunit alpha-2
Synonyms:GABA receptor alpha-2 subunit GBRA2_HUMAN | Gamma-aminobutyric acid receptor subunit alpha-2 (GABRA2)
Type:Protein
Mol. Mass.:51338.78
Organism:Homo sapiens (Human)
Description:P47869
Residue:451
BDBM50110711
NameBDBM50110711
Synonyms:3-Isopropylsulfanyl-6,6-dimethyl-1-(1H-pyrazol-3-yl)-6,7-dihydro-5H-benzo[c]thiophen-4-one | CHEMBL275645
TypeSmall organic molecule
Emp. Form.C16H20N2OS2
Mol. Mass.320.473
SMILESCC(C)Sc1sc(-c2cc[nH]n2)c2CC(C)(C)CC(=O)c12