Reaction Details
TargetBifunctional dihydrofolate reductase-thymidylate synthase
LigandBDBM50110764
Substrate/Competitorn/a
Meas. Tech.ChEMBL_55401 (CHEMBL668410)
Ki 415.2±n/a nM
Citation Tarnchompoo, BSirichaiwat, CPhupong, WIntaraudom, CSirawaraporn, WKamchonwongpaisan, SVanichtanankul, JThebtaranonth, YYuthavong, Y Development of 2,4-diaminopyrimidines as antimalarials based on inhibition of the S108N and C59R+S108N mutants of dihydrofolate reductase from pyrimethamine-resistant Plasmodium falciparum. J Med Chem45:1244-52 (2002) Bifunctional dihydrofolate reductase-thymidylate synthase
Name:Bifunctional dihydrofolate reductase-thymidylate synthase
Type:Enzyme
Mol. Mass.:71822.51
Organism:Plasmodium falciparum (isolate K1 / Thailand)
Description:The mutant clone was prepared by cassette mutagenesis using wildtype pfDHFR as a template, and expressed in E. coli.
Residue:608
BDBM50110764
NameBDBM50110764
Synonyms:5-(3,5-Dibromo-4-ethoxy-phenyl)-6-ethyl-pyrimidine-2,4-diamine | CHEMBL22271
TypeSmall organic molecule
Emp. Form.C14H16Br2N4O
Mol. Mass.416.111
SMILESCCOc1c(Br)cc(cc1Br)-c1c(N)nc(N)nc1CC