Reaction Details
TargetBifunctional dihydrofolate reductase-thymidylate synthase
LigandBDBM50110762
Substrate/Competitorn/a
Meas. Tech.ChEMBL_55401 (CHEMBL668410)
Ki 4±n/a nM
Citation Tarnchompoo, BSirichaiwat, CPhupong, WIntaraudom, CSirawaraporn, WKamchonwongpaisan, SVanichtanankul, JThebtaranonth, YYuthavong, Y Development of 2,4-diaminopyrimidines as antimalarials based on inhibition of the S108N and C59R+S108N mutants of dihydrofolate reductase from pyrimethamine-resistant Plasmodium falciparum. J Med Chem45:1244-52 (2002) Bifunctional dihydrofolate reductase-thymidylate synthase
Name:Bifunctional dihydrofolate reductase-thymidylate synthase
Type:Enzyme
Mol. Mass.:71822.51
Organism:Plasmodium falciparum (isolate K1 / Thailand)
Description:The mutant clone was prepared by cassette mutagenesis using wildtype pfDHFR as a template, and expressed in E. coli.
Residue:608
BDBM50110762
NameBDBM50110762
Synonyms:5-(3-Chloro-phenyl)-6-[3-(4-methoxy-phenyl)-propyl]-pyrimidine-2,4-diamine CHEMBL278813
TypeSmall organic molecule
Emp. Form.C20H21ClN4O
Mol. Mass.368.86
SMILESCOc1ccc(CCCc2nc(N)nc(N)c2-c2cccc(Cl)c2)cc1