Reaction Details
TargetBifunctional dihydrofolate reductase-thymidylate synthase
LigandBDBM50110772
Substrate/Competitorn/a
Meas. Tech.ChEMBL_55400 (CHEMBL668409)
Ki 23.3±n/a nM
Citation Tarnchompoo, BSirichaiwat, CPhupong, WIntaraudom, CSirawaraporn, WKamchonwongpaisan, SVanichtanankul, JThebtaranonth, YYuthavong, Y Development of 2,4-diaminopyrimidines as antimalarials based on inhibition of the S108N and C59R+S108N mutants of dihydrofolate reductase from pyrimethamine-resistant Plasmodium falciparum. J Med Chem45:1244-52 (2002) Bifunctional dihydrofolate reductase-thymidylate synthase
Name:Bifunctional dihydrofolate reductase-thymidylate synthase
Type:Enzyme
Mol. Mass.:71822.51
Organism:Plasmodium falciparum (isolate K1 / Thailand)
Description:The mutant clone was prepared by cassette mutagenesis using wildtype pfDHFR as a template, and expressed in E. coli.
Residue:608
BDBM50110772
NameBDBM50110772
Synonyms:5-(4-Chloro-phenyl)-6-(3-phenyl-propyl)-pyrimidine-2,4-diamine | CHEMBL21691
TypeSmall organic molecule
Emp. Form.C19H19ClN4
Mol. Mass.338.834
SMILESNc1nc(N)c(c(CCCc2ccccc2)n1)-c1ccc(Cl)cc1