Reaction Details
TargetBifunctional dihydrofolate reductase-thymidylate synthase
LigandBDBM50110758
Substrate/Competitorn/a
Meas. Tech.ChEMBL_55401 (CHEMBL668410)
Ki 7.1±n/a nM
Citation Tarnchompoo, BSirichaiwat, CPhupong, WIntaraudom, CSirawaraporn, WKamchonwongpaisan, SVanichtanankul, JThebtaranonth, YYuthavong, Y Development of 2,4-diaminopyrimidines as antimalarials based on inhibition of the S108N and C59R+S108N mutants of dihydrofolate reductase from pyrimethamine-resistant Plasmodium falciparum. J Med Chem45:1244-52 (2002) Bifunctional dihydrofolate reductase-thymidylate synthase
Name:Bifunctional dihydrofolate reductase-thymidylate synthase
Type:Enzyme
Mol. Mass.:71822.51
Organism:Plasmodium falciparum (isolate K1 / Thailand)
Description:The mutant clone was prepared by cassette mutagenesis using wildtype pfDHFR as a template, and expressed in E. coli.
Residue:608
BDBM50110758
NameBDBM50110758
Synonyms:5-(4-(benzyloxy)-3-ethoxybenzyl)pyrimidine-2,4-diamine CHEMBL21395
TypeSmall organic molecule
Emp. Form.C20H22N4O2
Mol. Mass.350.4143
SMILESCCOc1cc(Cc2cnc(N)nc2N)ccc1OCc1ccccc1