Reaction Details
TargetDihydrofolate reductase
LigandBDBM18512
Substrate/Competitorn/a
Meas. Tech.ChEMBL_54282 (CHEMBL669875)
Ki 8±n/a nM
Citation Tarnchompoo, BSirichaiwat, CPhupong, WIntaraudom, CSirawaraporn, WKamchonwongpaisan, SVanichtanankul, JThebtaranonth, YYuthavong, Y Development of 2,4-diaminopyrimidines as antimalarials based on inhibition of the S108N and C59R+S108N mutants of dihydrofolate reductase from pyrimethamine-resistant Plasmodium falciparum. J Med Chem45:1244-52 (2002) Dihydrofolate reductase
Name:Dihydrofolate reductase
Type:Enzyme
Mol. Mass.:21453.99
Organism:Homo sapiens (Human)
Description:Recombinant human DHFR.
Residue:187
BDBM18512
NameBDBM18512
Synonyms:5-(4-chlorophenyl)-6-ethylpyrimidine-2,4-diamine Pyrimethamine (Pyr) cid_4993
TypeSmall organic molecule
Emp. Form.C12H13ClN4
Mol. Mass.248.711
SMILESCCc1nc(N)nc(N)c1-c1ccc(Cl)cc1