Reaction Details
TargetBifunctional dihydrofolate reductase-thymidylate synthase
LigandBDBM18787
Substrate/Competitorn/a
Meas. Tech.ChEMBL_55402 (CHEMBL668411)
Ki 0.4±n/a nM
Citation Tarnchompoo, BSirichaiwat, CPhupong, WIntaraudom, CSirawaraporn, WKamchonwongpaisan, SVanichtanankul, JThebtaranonth, YYuthavong, Y Development of 2,4-diaminopyrimidines as antimalarials based on inhibition of the S108N and C59R+S108N mutants of dihydrofolate reductase from pyrimethamine-resistant Plasmodium falciparum. J Med Chem45:1244-52 (2002) Bifunctional dihydrofolate reductase-thymidylate synthase
Name:Bifunctional dihydrofolate reductase-thymidylate synthase
Type:Enzyme
Mol. Mass.:71822.51
Organism:Plasmodium falciparum (isolate K1 / Thailand)
Description:The mutant clone was prepared by cassette mutagenesis using wildtype pfDHFR as a template, and expressed in E. coli.
Residue:608
BDBM18787
NameBDBM18787
Synonyms:5-(3-chlorophenyl)-6-[2-(3-phenoxypropoxy)ethyl]pyrimidine-2,4-diamine P40
TypeSmall organic molecule
Emp. Form.C21H23ClN4O2
Mol. Mass.398.886
SMILESNc1nc(N)c(c(CCOCCCOc2ccccc2)n1)-c1cccc(Cl)c1