Reaction Details
TargetBifunctional dihydrofolate reductase-thymidylate synthase
LigandBDBM50110753
Substrate/Competitorn/a
Meas. Tech.ChEMBL_55400 (CHEMBL668409)
Ki 2.2±n/a nM
Citation Tarnchompoo, BSirichaiwat, CPhupong, WIntaraudom, CSirawaraporn, WKamchonwongpaisan, SVanichtanankul, JThebtaranonth, YYuthavong, Y Development of 2,4-diaminopyrimidines as antimalarials based on inhibition of the S108N and C59R+S108N mutants of dihydrofolate reductase from pyrimethamine-resistant Plasmodium falciparum. J Med Chem45:1244-52 (2002) Bifunctional dihydrofolate reductase-thymidylate synthase
Name:Bifunctional dihydrofolate reductase-thymidylate synthase
Type:Enzyme
Mol. Mass.:71822.51
Organism:Plasmodium falciparum (isolate K1 / Thailand)
Description:The mutant clone was prepared by cassette mutagenesis using wildtype pfDHFR as a template, and expressed in E. coli.
Residue:608
BDBM50110753
NameBDBM50110753
Synonyms:5-(3-ethoxy-4-(3,4,5-trimethoxybenzyloxy)benzyl)pyrimidine-2,4-diamine CHEMBL22901
TypeSmall organic molecule
Emp. Form.C23H28N4O5
Mol. Mass.440.4922
SMILESCCOc1cc(Cc2cnc(N)nc2N)ccc1OCc1cc(OC)c(OC)c(OC)c1