Reaction Details
TargetTransporter
LigandBDBM50110778
Substrate/Competitorn/a
Meas. Tech.ChEMBL_142783 (CHEMBL752158)
Ki 80.2±n/a nM
Citation Emond, PVercouillie, JInnis, RChalon, SMavel, SFrangin, YHalldin, CBesnard, JCGuilloteau, D Substituted diphenyl sulfides as selective serotonin transporter ligands: synthesis and in vitro evaluation. J Med Chem45:1253-8 (2002) Transporter
Name:Transporter
Type:PROTEIN
Mol. Mass.:66787.87
Organism:Rattus norvegicus
Description:ChEMBL_1463061
Residue:597
BDBM50110778
NameBDBM50110778
Synonyms:2-(2-Dimethylaminomethyl-phenylsulfanyl)-5-(2-iodo-vinyl)-phenylamine | CHEMBL277045
TypeSmall organic molecule
Emp. Form.C17H19IN2S
Mol. Mass.410.316
SMILESCN(C)Cc1ccccc1Sc1ccc(\C=C\I)cc1N