Reaction Details
TargetSodium-dependent serotonin transporter
LigandBDBM50110577
Substrate/Competitorn/a
Meas. Tech.ChEMBL_226364 (CHEMBL847532)
Ki 0.4±n/a nM
Citation Emond, PVercouillie, JInnis, RChalon, SMavel, SFrangin, YHalldin, CBesnard, JCGuilloteau, D Substituted diphenyl sulfides as selective serotonin transporter ligands: synthesis and in vitro evaluation. J Med Chem45:1253-8 (2002) Sodium-dependent serotonin transporter
Name:Sodium-dependent serotonin transporter
Type:Multi-pass membrane protein
Mol. Mass.:70168.43
Organism:Rattus norvegicus (rat)
Description:P31652
Residue:630
BDBM50110577
NameBDBM50110577
Synonyms:2-(2-((dimethylamino)methyl)phenylthio)-5-iodoaniline CHEMBL23034 | CHEMBL2314218
TypeSmall organic molecule
Emp. Form.C15H17IN2S
Mol. Mass.384.278
SMILESCN(C)Cc1ccccc1Sc1ccc(I)cc1N