Reaction Details
TargetSodium-dependent serotonin transporter
LigandBDBM50110787
Substrate/Competitorn/a
Meas. Tech.ChEMBL_226364 (CHEMBL847532)
Ki 19.3±n/a nM
Citation Emond, PVercouillie, JInnis, RChalon, SMavel, SFrangin, YHalldin, CBesnard, JCGuilloteau, D Substituted diphenyl sulfides as selective serotonin transporter ligands: synthesis and in vitro evaluation. J Med Chem45:1253-8 (2002) Sodium-dependent serotonin transporter
Name:Sodium-dependent serotonin transporter
Type:Multi-pass membrane protein
Mol. Mass.:70168.43
Organism:Rattus norvegicus (rat)
Description:P31652
Residue:630
BDBM50110787
NameBDBM50110787
Synonyms:2-(2-{[(2-Fluoro-ethyl)-methyl-amino]-methyl}-phenylsulfanyl)-5-iodo-phenylamine | CHEMBL22643
TypeSmall organic molecule
Emp. Form.C16H18FIN2S
Mol. Mass.416.295
SMILESCN(CCF)Cc1ccccc1Sc1ccc(I)cc1N