Reaction Details
TargetSodium-dependent serotonin transporter
LigandBDBM50110783
Substrate/Competitorn/a
Meas. Tech.ChEMBL_226364 (CHEMBL847532)
Ki 7.96±n/a nM
Citation Emond, PVercouillie, JInnis, RChalon, SMavel, SFrangin, YHalldin, CBesnard, JCGuilloteau, D Substituted diphenyl sulfides as selective serotonin transporter ligands: synthesis and in vitro evaluation. J Med Chem45:1253-8 (2002) Sodium-dependent serotonin transporter
Name:Sodium-dependent serotonin transporter
Type:Multi-pass membrane protein
Mol. Mass.:70168.43
Organism:Rattus norvegicus (rat)
Description:P31652
Residue:630
BDBM50110783
NameBDBM50110783
Synonyms:CHEMBL22743 | [2-(2-Dimethylaminomethyl-phenylsulfanyl)-5-fluoro-phenyl]-methanol
TypeSmall organic molecule
Emp. Form.C16H18FNOS
Mol. Mass.291.384
SMILESCN(C)Cc1ccccc1Sc1ccc(F)cc1CO