Reaction Details
TargetProstaglandin G/H synthase 1
LigandBDBM11639
Substrate/Competitorn/a
Meas. Tech.ChEMBL_158762 (CHEMBL772924)
IC50 2000±n/a nM
Citation Palomer, ACabré, FPascual, JCampos, JTrujillo, MAEntrena, AGallo, MAGarcía, LMauleón, DEspinosa, A Identification of novel cyclooxygenase-2 selective inhibitors using pharmacophore models. J Med Chem45:1402-11 (2002) Prostaglandin G/H synthase 1
Name:Prostaglandin G/H synthase 1
Type:Enzyme
Mol. Mass.:68692.62
Organism:Homo sapiens (Human)
Description:P23219
Residue:599
BDBM11639
NameBDBM11639
Synonyms:4-[5-(4-methylphenyl)-3-(trifluoromethyl)-1H-pyrazol-1-yl]benzene-1-sulfonamide CLX Celecoxib US11478464, Compound Celecoxib US8741944, Comparative Compound cid_2662
TypeSmall organic molecule
Emp. Form.C17H14F3N3O2S
Mol. Mass.381.372
SMILESCc1ccc(cc1)-c1cc(nn1-c1ccc(cc1)S(N)(=O)=O)C(F)(F)F