Reaction Details
TargetAdenosine receptor A1
LigandBDBM50037440
Substrate/Competitorn/a
Meas. Tech.ChEMBL_29625 (CHEMBL636643)
Ki 15±n/a nM
Citation Hayallah, AMSandoval-Ramírez, JReith, USchobert, UPreiss, BSchumacher, BDaly, JWMüller, CE 1,8-disubstituted xanthine derivatives: synthesis of potent A2B-selective adenosine receptor antagonists. J Med Chem45:1500-10 (2002) Adenosine receptor A1
Name:Adenosine receptor A1
Type:Protein
Mol. Mass.:36704.13
Organism:Rattus norvegicus (rat)
Description:n/a
Residue:326
BDBM50037440
NameBDBM50037440
Synonyms:(E)-3-[4-(2,6-Dioxo-1,3-dipropyl-2,3,6,7-tetrahydro-1H-purin-8-yl)-phenyl]-acrylic acid CHEMBL16997
TypeSmall organic molecule
Emp. Form.C20H22N4O4
Mol. Mass.382.4131
SMILESCCCn1c2nc([nH]c2c(=O)n(CCC)c1=O)-c1ccc(C=CC(O)=O)cc1