Reaction Details
TargetAdenosine receptor A2a
LigandBDBM50041590
Substrate/Competitorn/a
Meas. Tech.ChEMBL_30137 (CHEMBL641340)
Ki 1200±n/a nM
Citation Hayallah, AMSandoval-Ramírez, JReith, USchobert, UPreiss, BSchumacher, BDaly, JWMüller, CE 1,8-disubstituted xanthine derivatives: synthesis of potent A2B-selective adenosine receptor antagonists. J Med Chem45:1500-10 (2002) Adenosine receptor A2a
Name:Adenosine receptor A2a
Type:G Protein-Coupled Receptor (GPCR)
Mol. Mass.:45015.65
Organism:Rattus norvegicus (rat)
Description:Rat A2A receptors expressed in CHO cells.
Residue:410
BDBM50041590
NameBDBM50041590
Synonyms:6-Phenyl-3-propyl-1,5-dihydro-pyrrolo[3,2-d]pyrimidine-2,4-dione | CHEMBL35415
TypeSmall organic molecule
Emp. Form.C15H15N3O2
Mol. Mass.269.2985
SMILESCCCn1c(=O)[nH]c2cc([nH]c2c1=O)-c1ccccc1