Reaction Details
TargetAdenosine receptor A2b
LigandBDBM50042211
Substrate/Competitorn/a
Meas. Tech.ChEMBL_30604 (CHEMBL642011)
Ki 34.4±n/a nM
Citation Hayallah, AMSandoval-Ramírez, JReith, USchobert, UPreiss, BSchumacher, BDaly, JWMüller, CE 1,8-disubstituted xanthine derivatives: synthesis of potent A2B-selective adenosine receptor antagonists. J Med Chem45:1500-10 (2002) Adenosine receptor A2b
Name:Adenosine receptor A2b
Type:G Protein-Coupled Receptor (GPCR)
Mol. Mass.:36341.22
Organism:Homo sapiens (Human)
Description:n/a
Residue:332
BDBM50042211
NameBDBM50042211
Synonyms:8-Cyclopentyl-1-propyl-3,7-dihydro-purine-2,6-dione CHEMBL37243
TypeSmall organic molecule
Emp. Form.C13H18N4O2
Mol. Mass.262.3076
SMILESCCCn1c(=O)[nH]c2nc([nH]c2c1=O)C1CCCC1